cyberhost4.com

Home > Cannot Find

cannot find class in classpath testng command line

org.testng.testngexception cannot find class in classpath intellij

how to install ssl certificate in iis 7

cannot find symbol class android studio

the system cannot find the file specified utorrent

the system cannot find the batch label specified - end

batch file the system cannot find the path specified

x509certificate2 the system cannot find the file specified

windows server backup the system cannot find the file specified

80070002 the system cannot find the file specified

can't find regedit in safe mode

batch script the system cannot find the file specified

windows cannot find file make sure you typed the name correctly

file line 958, in _execute_child startupinfo)

java.lang.runtimeexception cannot find facescontext in adf

cannot find ftd2xx.dll please reinstall this application

import ioexception java

java.lang.runtimeexception: cannot find facescontext adf

tomcat the system cannot find the file specified

windows cannot find any networks vista

org.springframework.beans.factory.cannotloadbeanclassexception cannot find class for bean with name

cannot find fingerprint sensor device windows 7

cannot find symbol map

typescript import cannot find module

cannot find function includes in object javascript

vro typeerror: cannot find default value for object.

typeerror: cannot find function in object

typeerror: cannot find function addeventlistener in object [object]

"cannot find -lz" centos

cannot find device eth0 debian

cannot find function split in object javascript

cannot find grldr windows 7

/usr/bin/ld cannot find library

alsa lib confmisc.c:768:(parse_card) cannot find card '0' raspberry pi

@ taglib prefix= s uri= /struts-tags error

lncurses centos

eth0 no such device ubuntu

selenium "cannot find function addeventlistener"

cannot find function in object javascript

cannot find mysql header files under

openvpn tun0 not created

usr bin ld cannot find

configure: error: cannot find ldap.h centos

xrandr list outputs

cmake cannot find lpthreads

libperl-dev

id: cannot find name for group id sssd

groups cannot find name for group id ubuntu

usr bin ld cannot find lz

cannot find lncurses centos

cannot find hi rez installation steam smite

cannot find device eth0 failed to bring up eth0

checking for ssl headers... configure: error: cannot find ssl headers centos

xrandr output names

cannot find symbol java compile error

xrandr cannot find output vga1

error: cannot find ssl headers

configure: error: cannot find libz php55

cannot find device eth0 ubuntu

virtualbox eth1 missing

linux lssl

lgcc_s not found

cannot find device br0 failed to bring up br0

unzip cannot find or open in unix

checking for ssl libraries... configure: error: cannot find ssl libraries ubuntu

unable to start program visual studio 2010 the system cannot find the file specified

 - 1